Reaction Details
TargetCytochrome P450 2D6
LigandBDBM50255040
Substrate/Competitorn/a
Meas. Tech.ChEMBL_560252 (CHEMBL1019591)
IC50 17000±n/a nM
Citation Dhar, TGYang, GDavies, PMalley, MFGougoutas, JZWu, DRBarrish, JCCarter, PH Urea based CCR3 antagonists employing a tetrahydro-1,3-oxazin-2-one spacer. Bioorg Med Chem Lett19:96-9 (2008) 
 
Cytochrome P450 2D6
Name:Cytochrome P450 2D6
Type:Protein
Mol. Mass.:55774.82
Organism:Homo sapiens (Human)
Description:P10635
Residue:497
BDBM50255040
NameBDBM50255040
Synonyms:1-(6-(((S)-3-(4-fluorobenzyl) piperidin-1-yl)methyl)-3,5-dimethyl-2-oxo-1,3-oxazinan-5-yl)-3-(3-(1-methyl-1H-tetrazol-5-yl)phenyl)urea CHEMBL518571
TypeSmall organic molecule
Emp. Form.C28H35FN8O3
Mol. Mass.550.6277
SMILESCN1CC(C)(NC(=O)Nc2cccc(c2)-c2nnnn2C)C(CN2CCC[C@@H](Cc3ccc(F)cc3)C2)OC1=O