Reaction Details
TargetGalanin receptor type 1
LigandBDBM50256666
Substrate/Competitorn/a
Meas. Tech.ChEMBL_515047 (CHEMBL1034789)
IC50 10.2±n/a nM
Citation Terui, YChu, YWLi, JYAndo, TFukunaga, TAoki, TToda, Y New cyclic tetrapeptides from Nonomuraea sp. TA-0426 that inhibit glycine transporter type 1 (GlyT1). Bioorg Med Chem Lett18:6321-3 (2008) 
 
Galanin receptor type 1
Name:Galanin receptor type 1
Type:Enzyme Catalytic Domain
Mol. Mass.:38883.91
Organism:RAT
Description:Galanin R1 GALR1 RAT::Q62805
Residue:346
BDBM50256666
NameBDBM50256666
Synonyms:(3S,6S,9S,12S)-3-benzyl-12-sec-butyl-6-((2S,3R)-3-hydroxybutan-2-yl)-9-isopropyl-1,4,7,10-tetraazacyclododecane-2,5,8,11-tetraone | CHEMBL473840
TypeSmall organic molecule
Emp. Form.C26H40N4O5
Mol. Mass.488.6196
SMILESCC[C@H](C)[C@@H]1NC(=O)[C@H](Cc2ccccc2)NC(=O)[C@@H](NC(=O)[C@@H](NC1=O)C(C)C)[C@H](C)[C@@H](C)O