Reaction Details
TargetCytochrome P450 1A2
LigandBDBM50254678
Substrate/Competitorn/a
Meas. Tech.ChEMBL_560755 (CHEMBL1011723)
IC50 160±n/a nM
Citation Wang, YBusch-Petersen, JWang, FKiesow, TJGraybill, TLJin, JYang, ZFoley, JJHunsberger, GESchmidt, DBSarau, HMCapper-Spudich, EAWu, ZFisher, LSMcQueney, MSRivero, RAWiddowson, KL Camphor sulfonamide derivatives as novel, potent and selective CXCR3 antagonists. Bioorg Med Chem Lett19:114-8 (2008) 
 
Cytochrome P450 1A2
Name:Cytochrome P450 1A2
Type:Enzyme
Mol. Mass.:58423.38
Organism:Homo sapiens (Human)
Description:P05177
Residue:516
BDBM50254678
NameBDBM50254678
Synonyms:(1S,4R)-1-(((S)-4-(3-fluoro-5-(trifluoromethyl)pyridin-2-yl)-3-methylpiperazin-1-ylsulfonyl)methyl)-7,7-dimethylbicyclo[2.2.1]heptan-2-one | CHEMBL480016
TypeSmall organic molecule
Emp. Form.C21H27F4N3O3S
Mol. Mass.477.516
SMILESC[C@H]1CN(CCN1c1ncc(cc1F)C(F)(F)F)S(=O)(=O)C[C@]12CC[C@H](CC1=O)C2(C)C