Reaction Details
TargetC-X-C chemokine receptor type 3
LigandBDBM50254758
Substrate/Competitorn/a
Meas. Tech.ChEMBL_560734 (CHEMBL1010869)
IC50 200±n/a nM
Citation Wang, YBusch-Petersen, JWang, FKiesow, TJGraybill, TLJin, JYang, ZFoley, JJHunsberger, GESchmidt, DBSarau, HMCapper-Spudich, EAWu, ZFisher, LSMcQueney, MSRivero, RAWiddowson, KL Camphor sulfonamide derivatives as novel, potent and selective CXCR3 antagonists. Bioorg Med Chem Lett19:114-8 (2008) 
 
C-X-C chemokine receptor type 3
Name:C-X-C chemokine receptor type 3
Type:PROTEIN
Mol. Mass.:41020.84
Organism:Mus musculus
Description:ChEMBL_560734
Residue:367
BDBM50254758
NameBDBM50254758
Synonyms:(1S,2S,4R)-1-(((S)-4-(3-fluoro-5-(trifluoromethyl)pyridin-2-yl)-3-methylpiperazin-1-ylsulfonyl)methyl)-7,7-dimethylbicyclo[2.2.1]heptan-2-ol | CHEMBL464234
TypeSmall organic molecule
Emp. Form.C21H29F4N3O3S
Mol. Mass.479.532
SMILESC[C@H]1CN(CCN1c1ncc(cc1F)C(F)(F)F)S(=O)(=O)C[C@]12CC[C@H](C[C@@H]1O)C2(C)C