Reaction Details
TargetC-X-C chemokine receptor type 3
LigandBDBM50412556
Substrate/Competitorn/a
Meas. Tech.ChEMBL_560734 (CHEMBL1010869)
IC50 200±n/a nM
Citation Wang, YBusch-Petersen, JWang, FKiesow, TJGraybill, TLJin, JYang, ZFoley, JJHunsberger, GESchmidt, DBSarau, HMCapper-Spudich, EAWu, ZFisher, LSMcQueney, MSRivero, RAWiddowson, KL Camphor sulfonamide derivatives as novel, potent and selective CXCR3 antagonists. Bioorg Med Chem Lett19:114-8 (2008) 
 
C-X-C chemokine receptor type 3
Name:C-X-C chemokine receptor type 3
Type:PROTEIN
Mol. Mass.:41020.84
Organism:Mus musculus
Description:ChEMBL_560734
Residue:367
BDBM50412556
NameBDBM50412556
Synonyms:CHEMBL481198
TypeSmall organic molecule
Emp. Form.C21H30F3N3O3S
Mol. Mass.461.541
SMILESC[C@H]1CN(CCN1c1ccc(cn1)C(F)(F)F)S(=O)(=O)C[C@]12CC[C@H](C[C@@H]1O)C2(C)C