Reaction Details
TargetC-X-C chemokine receptor type 3
LigandBDBM50412576
Substrate/Competitorn/a
Meas. Tech.ChEMBL_560732 (CHEMBL1010867)
IC50 316.23±n/a nM
Citation Wang, YBusch-Petersen, JWang, FKiesow, TJGraybill, TLJin, JYang, ZFoley, JJHunsberger, GESchmidt, DBSarau, HMCapper-Spudich, EAWu, ZFisher, LSMcQueney, MSRivero, RAWiddowson, KL Camphor sulfonamide derivatives as novel, potent and selective CXCR3 antagonists. Bioorg Med Chem Lett19:114-8 (2008) 
 
C-X-C chemokine receptor type 3
Name:C-X-C chemokine receptor type 3
Type:Enzyme Catalytic Domain
Mol. Mass.:40665.65
Organism:Homo sapiens (Human)
Description:n/a
Residue:368
BDBM50412576
NameBDBM50412576
Synonyms:CHEMBL480996
TypeSmall organic molecule
Emp. Form.C20H24Cl2F3N3O3S
Mol. Mass.514.389
SMILESCC1(C)[C@@H]2CC[C@@]1(CS(=O)(=O)N1CCN(CC1)c1nc(Cl)c(cc1Cl)C(F)(F)F)C(=O)C2