Reaction Details
TargetProtein kinase C beta type
LigandBDBM50255013
Substrate/Competitorn/a
Meas. Tech.ChEMBL_558471 (CHEMBL963877)
IC50 2000±n/a nM
Citation Tecle, HShao, JLi, YKothe, MKazmirski, SPenzotti, JDing, YHOhren, JMoshinsky, DColi, RJhawar, NBora, EJacques-O'Hagan, SWu, J Beyond the MEK-pocket: can current MEK kinase inhibitors be utilized to synthesize novel type III NCKIs? Does the MEK-pocket exist in kinases other than MEK? Bioorg Med Chem Lett19:226-9 (2008) 
 
Protein kinase C beta type
Name:Protein kinase C beta type
Type:Enzyme
Mol. Mass.:76873.67
Organism:Homo sapiens (Human)
Description:The recombinant human PKC enzymes were produced using a baculovirus expression system in SF9 cells
Residue:671
BDBM50255013
NameBDBM50255013
Synonyms:(S)-5-((2,4-diamino-4-oxobutanamido)methyl)-3,4-difluoro-2-(2-fluoro-4-iodophenylamino)benzoic acid | CHEMBL517647
TypeSmall organic molecule
Emp. Form.C18H16F3IN4O4
Mol. Mass.536.2437
SMILESN[C@@H](CC(N)=O)C(=O)NCc1cc(C(O)=O)c(Nc2ccc(I)cc2F)c(F)c1F