Reaction Details
TargetProtein kinase C beta type
LigandBDBM50255048
Substrate/Competitorn/a
Meas. Tech.ChEMBL_558471 (CHEMBL963877)
IC50>30000±n/a nM
Citation Tecle, HShao, JLi, YKothe, MKazmirski, SPenzotti, JDing, YHOhren, JMoshinsky, DColi, RJhawar, NBora, EJacques-O'Hagan, SWu, J Beyond the MEK-pocket: can current MEK kinase inhibitors be utilized to synthesize novel type III NCKIs? Does the MEK-pocket exist in kinases other than MEK? Bioorg Med Chem Lett19:226-9 (2008) 
 
Protein kinase C beta type
Name:Protein kinase C beta type
Type:Enzyme
Mol. Mass.:76873.67
Organism:Homo sapiens (Human)
Description:The recombinant human PKC enzymes were produced using a baculovirus expression system in SF9 cells
Residue:671
BDBM50255048
NameBDBM50255048
Synonyms:3,4-Difluoro-2-(2-fluoro-4-iodo-phenylamino)-5-[(5-hydroxymethyl-furan-2-carbonyl)-hydrazonomethyl]-benzoic acid | CHEMBL481968
TypeSmall organic molecule
Emp. Form.C20H13F3IN3O5
Mol. Mass.559.234
SMILESOCc1ccc(o1)C(=O)NN=Cc1cc(C(O)=O)c(Nc2ccc(I)cc2F)c(F)c1F