Reaction Details
TargetCytochrome P450 1A2
LigandBDBM50254513
Substrate/Competitorn/a
Meas. Tech.ChEMBL_558480 (CHEMBL963886)
IC50 100000±n/a nM
Citation Barnett, HACoe, DMCooper, TWJack, TIJones, HTMacdonald, SJMcLay, IMRayner, NSasse, RZShipley, TJSkone, PASomers, GITaylor, SUings, IJWoolven, JMWeingarten, GG Aryl aminopyrazole benzamides as oral non-steroidal selective glucocorticoid receptor agonists. Bioorg Med Chem Lett19:158-62 (2008) 
 
Cytochrome P450 1A2
Name:Cytochrome P450 1A2
Type:Enzyme
Mol. Mass.:58423.38
Organism:Homo sapiens (Human)
Description:P05177
Residue:516
BDBM50254513
NameBDBM50254513
Synonyms:5-amino-N-(2-((N-ethyl-2,6-difluorobenzamido)methyl)-3,3,3-trifluoro-2-hydroxypropyl)-1-(4-fluorophenyl)-1H-pyrazole-4-carboxamide | CHEMBL467633
TypeSmall organic molecule
Emp. Form.C23H21F6N5O3
Mol. Mass.529.435
SMILESCCN(CC(O)(CNC(=O)c1cnn(c1N)-c1ccc(F)cc1)C(F)(F)F)C(=O)c1c(F)cccc1F