Reaction Details
TargetCytochrome P450 1A2
LigandBDBM50254679
Substrate/Competitorn/a
Meas. Tech.ChEMBL_558480 (CHEMBL963886)
IC50 100000±n/a nM
Citation Barnett, HACoe, DMCooper, TWJack, TIJones, HTMacdonald, SJMcLay, IMRayner, NSasse, RZShipley, TJSkone, PASomers, GITaylor, SUings, IJWoolven, JMWeingarten, GG Aryl aminopyrazole benzamides as oral non-steroidal selective glucocorticoid receptor agonists. Bioorg Med Chem Lett19:158-62 (2008) 
 
Cytochrome P450 1A2
Name:Cytochrome P450 1A2
Type:Enzyme
Mol. Mass.:58423.38
Organism:Homo sapiens (Human)
Description:P05177
Residue:516
BDBM50254679
NameBDBM50254679
Synonyms:(+/-)-N-(2-((5-amino-1-(4-fluorophenyl)-1H-pyrazole-4-carboxamido)methyl)-3,3,3-trifluoro-2-hydroxypropyl)-3-chloro-N-ethylpicolinamide N-(2-((5-amino-1-(4-fluorophenyl)-1H-pyrazole-4-carboxamido)methyl)-3,3,3-trifluoro-2-hydroxypropyl)-3-chloro-N-ethylpicolinamide
TypeSmall organic molecule
Emp. Form.C22H21ClF4N6O3
Mol. Mass.528.887
SMILESCCN(CC(O)(CNC(=O)c1cnn(c1N)-c1ccc(F)cc1)C(F)(F)F)C(=O)c1ncccc1Cl