Reaction Details
TargetCytochrome P450 2C19
LigandBDBM50254723
Substrate/Competitorn/a
Meas. Tech.ChEMBL_558481 (CHEMBL963887)
IC50 49000±n/a nM
Citation Barnett, HACoe, DMCooper, TWJack, TIJones, HTMacdonald, SJMcLay, IMRayner, NSasse, RZShipley, TJSkone, PASomers, GITaylor, SUings, IJWoolven, JMWeingarten, GG Aryl aminopyrazole benzamides as oral non-steroidal selective glucocorticoid receptor agonists. Bioorg Med Chem Lett19:158-62 (2008) 
 
Cytochrome P450 2C19
Name:Cytochrome P450 2C19
Type:Enzyme
Mol. Mass.:55935.47
Organism:Homo sapiens (Human)
Description:P33261
Residue:490
BDBM50254723
NameBDBM50254723
Synonyms:(+/-)-5-amino-N-(2-((2,6-difluoro-N-methylbenzamido)methyl)-3,3,3-trifluoro-2-hydroxypropyl)-1-(4-fluorophenyl)-1H-pyrazole-4-carboxamide | CHEMBL464907
TypeSmall organic molecule
Emp. Form.C22H19F6N5O3
Mol. Mass.515.4084
SMILESCN(CC(O)(CNC(=O)c1cnn(c1N)-c1ccc(F)cc1)C(F)(F)F)C(=O)c1c(F)cccc1F