Reaction Details
TargetCytochrome P450 3A4
LigandBDBM50254760
Substrate/Competitorn/a
Meas. Tech.ChEMBL_558484 (CHEMBL963890)
IC50 76000±n/a nM
Citation Barnett, HACoe, DMCooper, TWJack, TIJones, HTMacdonald, SJMcLay, IMRayner, NSasse, RZShipley, TJSkone, PASomers, GITaylor, SUings, IJWoolven, JMWeingarten, GG Aryl aminopyrazole benzamides as oral non-steroidal selective glucocorticoid receptor agonists. Bioorg Med Chem Lett19:158-62 (2008) 
 
Cytochrome P450 3A4
Name:Cytochrome P450 3A4
Type:Enzyme
Mol. Mass.:57349.57
Organism:Homo sapiens (Human)
Description:n/a
Residue:503
BDBM50254760
NameBDBM50254760
Synonyms:5-amino-N-(2-((2,6-difluoro-N-(2-hydroxyethyl)benzamido)methyl)-3,3,3-trifluoro-2-hydroxypropyl)-1-(4-fluorophenyl)-1H-pyrazole-4-carboxamide | CHEMBL517933
TypeSmall organic molecule
Emp. Form.C23H21F6N5O4
Mol. Mass.545.4344
SMILESNc1c(cnn1-c1ccc(F)cc1)C(=O)NCC(O)(CN(CCO)C(=O)c1c(F)cccc1F)C(F)(F)F