Reaction Details
TargetGlucocorticoid receptor
LigandBDBM50412609
Substrate/Competitorn/a
Meas. Tech.ChEMBL_558478 (CHEMBL963884)
EC50 50.12±n/a nM
Citation Barnett, HACoe, DMCooper, TWJack, TIJones, HTMacdonald, SJMcLay, IMRayner, NSasse, RZShipley, TJSkone, PASomers, GITaylor, SUings, IJWoolven, JMWeingarten, GG Aryl aminopyrazole benzamides as oral non-steroidal selective glucocorticoid receptor agonists. Bioorg Med Chem Lett19:158-62 (2008) 
 
Glucocorticoid receptor
Name:Glucocorticoid receptor
Type:Enzyme
Mol. Mass.:85656.87
Organism:Homo sapiens (Human)
Description:P04150
Residue:777
BDBM50412609
NameBDBM50412609
Synonyms:CHEMBL520750
TypeSmall organic molecule
Emp. Form.C23H21ClF5N5O3
Mol. Mass.545.89
SMILESCCN(CC(O)(CNC(=O)c1cnn(c1N)-c1ccc(F)cc1)C(F)(F)F)C(=O)c1cccc(F)c1Cl