Reaction Details
TargetGlucocorticoid receptor
LigandBDBM50254723
Substrate/Competitorn/a
Meas. Tech.ChEMBL_558478 (CHEMBL963884)
EC50 251.19±n/a nM
Citation Barnett, HACoe, DMCooper, TWJack, TIJones, HTMacdonald, SJMcLay, IMRayner, NSasse, RZShipley, TJSkone, PASomers, GITaylor, SUings, IJWoolven, JMWeingarten, GG Aryl aminopyrazole benzamides as oral non-steroidal selective glucocorticoid receptor agonists. Bioorg Med Chem Lett19:158-62 (2008) 
 
Glucocorticoid receptor
Name:Glucocorticoid receptor
Type:Enzyme
Mol. Mass.:85656.87
Organism:Homo sapiens (Human)
Description:P04150
Residue:777
BDBM50254723
NameBDBM50254723
Synonyms:(+/-)-5-amino-N-(2-((2,6-difluoro-N-methylbenzamido)methyl)-3,3,3-trifluoro-2-hydroxypropyl)-1-(4-fluorophenyl)-1H-pyrazole-4-carboxamide | CHEMBL464907
TypeSmall organic molecule
Emp. Form.C22H19F6N5O3
Mol. Mass.515.4084
SMILESCN(CC(O)(CNC(=O)c1cnn(c1N)-c1ccc(F)cc1)C(F)(F)F)C(=O)c1c(F)cccc1F