Reaction Details
TargetSerine/threonine-protein kinase 17A
LigandBDBM50273636
Substrate/Competitorn/a
Meas. Tech.ChEMBL_537119 (CHEMBL988951)
Kd 96±n/a nM
Citation Bamborough, PDrewry, DHarper, GSmith, GKSchneider, K Assessment of chemical coverage of kinome space and its implications for kinase drug discovery. J Med Chem51:7898-914 (2008) 
 
Serine/threonine-protein kinase 17A
Name:Serine/threonine-protein kinase 17A
Type:Enzyme Catalytic Domain
Mol. Mass.:46544.04
Organism:Homo sapiens (Human)
Description:gi_109255245
Residue:414
BDBM50273636
NameBDBM50273636
Synonyms:4-(5-(4-fluorophenyl)-1H-pyrazol-3-ylamino)benzamide | CHEMBL511337
TypeSmall organic molecule
Emp. Form.C16H13FN4O
Mol. Mass.296.299
SMILESNC(=O)c1ccc(Nc2cc(n[nH]2)-c2ccc(F)cc2)cc1