Reaction Details
TargetTyrosine-protein kinase Yes
LigandBDBM26145
Substrate/Competitorn/a
Meas. Tech.ChEMBL_537094 (CHEMBL988926)
Kd 1±n/a nM
Citation Bamborough, PDrewry, DHarper, GSmith, GKSchneider, K Assessment of chemical coverage of kinome space and its implications for kinase drug discovery. J Med Chem51:7898-914 (2008) 
 
Tyrosine-protein kinase Yes
Name:Tyrosine-protein kinase Yes
Type:Protein
Mol. Mass.:60801.54
Organism:Homo sapiens (Human)
Description:P07947
Residue:543
BDBM26145
NameBDBM26145
Synonyms:2,4-dianilino pyrimidine, 2 CHEMBL249097
TypeSmall organic molecule
Emp. Form.C18H17N5O2
Mol. Mass.335.3599
SMILESCc1ccc(O)cc1Nc1ccnc(Nc2cccc(c2)C(N)=O)n1