Reaction Details
TargetTyrosine-protein kinase receptor TYRO3
LigandBDBM26145
Substrate/Competitorn/a
Meas. Tech.ChEMBL_537099 (CHEMBL988931)
Kd 264±n/a nM
Citation Bamborough, PDrewry, DHarper, GSmith, GKSchneider, K Assessment of chemical coverage of kinome space and its implications for kinase drug discovery. J Med Chem51:7898-914 (2008) 
 
Tyrosine-protein kinase receptor TYRO3
Name:Tyrosine-protein kinase receptor TYRO3
Type:Protein
Mol. Mass.:96894.13
Organism:Homo sapiens (Human)
Description:Q06418
Residue:890
BDBM26145
NameBDBM26145
Synonyms:2,4-dianilino pyrimidine, 2 CHEMBL249097
TypeSmall organic molecule
Emp. Form.C18H17N5O2
Mol. Mass.335.3599
SMILESCc1ccc(O)cc1Nc1ccnc(Nc2cccc(c2)C(N)=O)n1