Reaction Details
TargetTyrosine-protein kinase TXK
LigandBDBM50126419
Substrate/Competitorn/a
Meas. Tech.ChEMBL_537092 (CHEMBL988924)
Kd 395±n/a nM
Citation Bamborough, PDrewry, DHarper, GSmith, GKSchneider, K Assessment of chemical coverage of kinome space and its implications for kinase drug discovery. J Med Chem51:7898-914 (2008) 
 
Tyrosine-protein kinase TXK
Name:Tyrosine-protein kinase TXK
Type:Protein
Mol. Mass.:61268.80
Organism:Homo sapiens (Human)
Description:P42681
Residue:527
BDBM50126419
NameBDBM50126419
Synonyms:CHEMBL282342 N1-(7-(4-(dimethylamino)phenyl)-1,6-naphthyridin-5-yl)butane-1,4-diamine
TypeSmall organic molecule
Emp. Form.C20H25N5
Mol. Mass.335.446
SMILESCN(C)c1ccc(cc1)-c1cc2ncccc2c(NCCCCN)n1