Reaction Details
TargetDual specificity protein kinase CLK2
LigandBDBM50273635
Substrate/Competitorn/a
Meas. Tech.ChEMBL_537114 (CHEMBL988946)
Kd 10±n/a nM
Citation Bamborough, PDrewry, DHarper, GSmith, GKSchneider, K Assessment of chemical coverage of kinome space and its implications for kinase drug discovery. J Med Chem51:7898-914 (2008) 
 
Dual specificity protein kinase CLK2
Name:Dual specificity protein kinase CLK2
Type:n/a
Mol. Mass.:60128.79
Organism:Homo sapiens (Human)
Description:P49760
Residue:499
BDBM50273635
NameBDBM50273635
Synonyms:1-(4-methyl-2,5-di(pyridin-4-yl)-1H-pyrrol-3-yl)ethanone | CHEMBL526901
TypeSmall organic molecule
Emp. Form.C17H15N3O
Mol. Mass.277.3205
SMILESCC(=O)c1c(C)c([nH]c1-c1ccncc1)-c1ccncc1