Reaction Details
TargetSerine/threonine-protein kinase Nek7
LigandBDBM50273636
Substrate/Competitorn/a
Meas. Tech.ChEMBL_537120 (CHEMBL988952)
Kd>40000±n/a nM
Citation Bamborough, PDrewry, DHarper, GSmith, GKSchneider, K Assessment of chemical coverage of kinome space and its implications for kinase drug discovery. J Med Chem51:7898-914 (2008) 
 
Serine/threonine-protein kinase Nek7
Name:Serine/threonine-protein kinase Nek7
Type:PROTEIN
Mol. Mass.:34559.15
Organism:Homo sapiens (Human)
Description:ChEMBL_586832
Residue:302
BDBM50273636
NameBDBM50273636
Synonyms:4-(5-(4-fluorophenyl)-1H-pyrazol-3-ylamino)benzamide | CHEMBL511337
TypeSmall organic molecule
Emp. Form.C16H13FN4O
Mol. Mass.296.299
SMILESNC(=O)c1ccc(Nc2cc(n[nH]2)-c2ccc(F)cc2)cc1