Reaction Details
TargetTyrosine-protein kinase FRK
LigandBDBM50263295
Substrate/Competitorn/a
Meas. Tech.ChEMBL_537126 (CHEMBL988960)
Kd 122±n/a nM
Citation Bamborough, PDrewry, DHarper, GSmith, GKSchneider, K Assessment of chemical coverage of kinome space and its implications for kinase drug discovery. J Med Chem51:7898-914 (2008) 
 
Tyrosine-protein kinase FRK
Name:Tyrosine-protein kinase FRK
Type:Tyrosine-protein kinase
Mol. Mass.:58254.41
Organism:Homo sapiens (Human)
Description:P42685
Residue:505
BDBM50263295
NameBDBM50263295
Synonyms:6-Methyl-biphenyl-3,4'-dicarboxylic acid 3-[(3-tert-butyl-phenyl)-amide] 4'-cyclopropylmethyl-amide N3-(3-tert-butylphenyl)-N4'-(cyclopropylmethyl)-6-methylbiphenyl-3,4'-dicarboxamide
TypeSmall organic molecule
Emp. Form.C29H32N2O2
Mol. Mass.440.5766
SMILESCc1ccc(cc1-c1ccc(cc1)C(=O)NCC1CC1)C(=O)Nc1cccc(c1)C(C)(C)C