Reaction Details
TargetLysine--tRNA ligase
LigandBDBM50126419
Substrate/Competitorn/a
Meas. Tech.ChEMBL_538127 (CHEMBL1025770)
IC50 34±n/a nM
Citation Bamborough, PDrewry, DHarper, GSmith, GKSchneider, K Assessment of chemical coverage of kinome space and its implications for kinase drug discovery. J Med Chem51:7898-914 (2008) 
 
Lysine--tRNA ligase
Name:Lysine--tRNA ligase
Type:PROTEIN
Mol. Mass.:68044.78
Organism:Homo sapiens (Human)
Description:ChEMBL_960665
Residue:597
BDBM50126419
NameBDBM50126419
Synonyms:CHEMBL282342 N1-(7-(4-(dimethylamino)phenyl)-1,6-naphthyridin-5-yl)butane-1,4-diamine
TypeSmall organic molecule
Emp. Form.C20H25N5
Mol. Mass.335.446
SMILESCN(C)c1ccc(cc1)-c1cc2ncccc2c(NCCCCN)n1