Reaction Details
TargetSerine/threonine-protein kinase Nek2
LigandBDBM50273541
Substrate/Competitorn/a
Meas. Tech.ChEMBL_537065 (CHEMBL986214)
Kd 483±n/a nM
Citation Bamborough, PDrewry, DHarper, GSmith, GKSchneider, K Assessment of chemical coverage of kinome space and its implications for kinase drug discovery. J Med Chem51:7898-914 (2008) 
 
Serine/threonine-protein kinase Nek2
Name:Serine/threonine-protein kinase Nek2
Type:Enzyme
Mol. Mass.:51776.96
Organism:Homo sapiens (Human)
Description:P51955
Residue:445
BDBM50273541
NameBDBM50273541
Synonyms:CHEMBL516312 | N-(5-(4-cyanophenyl)-1H-pyrrolo[2,3-b]pyridin-3-yl)nicotinamide
TypeSmall organic molecule
Emp. Form.C20H13N5O
Mol. Mass.339.3501
SMILESO=C(Nc1c[nH]c2ncc(cc12)-c1ccc(cc1)C#N)c1cccnc1