Reaction Details
TargetCoagulation factor X
LigandBDBM50243539
Substrate/Competitorn/a
Meas. Tech.ChEMBL_544730 (CHEMBL1010168)
Ki 0.18±n/a nM
Citation Qiao, JXKing, SRHe, KWong, PCRendina, ARLuettgen, JMXin, BKnabb, RMWexler, RRLam, PY Highly efficacious factor Xa inhibitors containing alpha-substituted phenylcycloalkyl P4 moieties. Bioorg Med Chem Lett19:462-8 (2008) 
 
Coagulation factor X
Name:Coagulation factor X
Type:Enzyme
Mol. Mass.:54726.60
Organism:Homo sapiens (Human)
Description:n/a
Residue:488
BDBM50243539
NameBDBM50243539
Synonyms:1-(4-methoxyphenyl)-6-(4-(1-((methylamino)methyl)cyclopropyl)phenyl)-3-(trifluoromethyl)-5,6-dihydro-1H-pyrazolo[3,4-c]pyridin-7(4H)-one | CHEMBL460884
TypeSmall organic molecule
Emp. Form.C25H25F3N4O2
Mol. Mass.470.4868
SMILESCNCC1(CC1)c1ccc(cc1)N1CCc2c(nn(c2C1=O)-c1ccc(OC)cc1)C(F)(F)F