Reaction Details
TargetCoagulation factor X
LigandBDBM50265978
Substrate/Competitorn/a
Meas. Tech.ChEMBL_544730 (CHEMBL1010168)
Ki 0.15±n/a nM
Citation Qiao, JXKing, SRHe, KWong, PCRendina, ARLuettgen, JMXin, BKnabb, RMWexler, RRLam, PY Highly efficacious factor Xa inhibitors containing alpha-substituted phenylcycloalkyl P4 moieties. Bioorg Med Chem Lett19:462-8 (2008) 
 
Coagulation factor X
Name:Coagulation factor X
Type:Enzyme
Mol. Mass.:54726.60
Organism:Homo sapiens (Human)
Description:n/a
Residue:488
BDBM50265978
NameBDBM50265978
Synonyms:1-(4-methoxyphenyl)-6-(4-(1-((methylamino)methyl)cyclopropyl)phenyl)-7-oxo-4,5,6,7-tetrahydro-1H-pyrazolo[3,4-c]pyridine-3-carbonitrile | CHEMBL516771
TypeSmall organic molecule
Emp. Form.C25H25N5O2
Mol. Mass.427.4983
SMILESCNCC1(CC1)c1ccc(cc1)N1CCc2c(nn(c2C1=O)-c1ccc(OC)cc1)C#N