Reaction Details
TargetCoagulation factor X
LigandBDBM50266215
Substrate/Competitorn/a
Meas. Tech.ChEMBL_544730 (CHEMBL1010168)
Ki 0.02±n/a nM
Citation Qiao, JXKing, SRHe, KWong, PCRendina, ARLuettgen, JMXin, BKnabb, RMWexler, RRLam, PY Highly efficacious factor Xa inhibitors containing alpha-substituted phenylcycloalkyl P4 moieties. Bioorg Med Chem Lett19:462-8 (2008) 
 
Coagulation factor X
Name:Coagulation factor X
Type:Enzyme
Mol. Mass.:54726.60
Organism:Homo sapiens (Human)
Description:n/a
Residue:488
BDBM50266215
NameBDBM50266215
Synonyms:1-(4-methoxyphenyl)-6-(4-(1-(2-(pyrrolidin-1-yl)ethyl)cyclopropyl)phenyl)-3-(trifluoromethyl)-5,6-dihydro-1H-pyrazolo[3,4-c]pyridin-7(4H)-one | CHEMBL540198
TypeSmall organic molecule
Emp. Form.C29H31F3N4O2
Mol. Mass.524.5772
SMILESCOc1ccc(cc1)-n1nc(c2CCN(C(=O)c12)c1ccc(cc1)C1(CCN2CCCC2)CC1)C(F)(F)F