Reaction Details
TargetCytochrome P450 2C9
LigandBDBM50000306
Substrate/Competitorn/a
Meas. Tech.ChEMBL_537844 (CHEMBL989845)
IC50 58900±n/a nM
Citation Lucas, SHeim, RRies, CSchewe, KEBirk, BHartmann, RW In vivo active aldosterone synthase inhibitors with improved selectivity: lead optimization providing a series of pyridine substituted 3,4-dihydro-1H-quinolin-2-one derivatives. J Med Chem51:8077-87 (2008) 
 
Cytochrome P450 2C9
Name:Cytochrome P450 2C9
Type:Enzyme
Mol. Mass.:55636.33
Organism:Homo sapiens (Human)
Description:P11712
Residue:490
BDBM50000306
NameBDBM50000306
Synonyms:6-Pyridin-3-yl-3,4-dihydro-1H-quinolin-2-one 6-Pyridin-3-yl-3,4-dihydroquinolin-2(1H)-on | CHEMBL62811
TypeSmall organic molecule
Emp. Form.C14H12N2O
Mol. Mass.224.2579
SMILESO=C1CCc2cc(ccc2N1)-c1cccnc1