Reaction Details
TargetAcetylcholinesterase
LigandBDBM50273380
Substrate/Competitorn/a
Meas. Tech.ChEMBL_560895 (CHEMBL1013530)
IC50 7.7±n/a nM
Citation Fang, LAppenroth, DDecker, MKiehntopf, MLupp, APeng, SFleck, CZhang, YLehmann, J NO-donating tacrine hybrid compounds improve scopolamine-induced cognition impairment and show less hepatotoxicity. J Med Chem51:7666-9 (2008) 
 
Acetylcholinesterase
Name:Acetylcholinesterase
Type:Enzyme
Mol. Mass.:71812.79
Organism:Electrophorus electricus (Electric eel)
Description:n/a
Residue:633
BDBM50273380
NameBDBM50273380
Synonyms:9-[N(theta)-(2'-(Nitrooxy)ethyl)-theta-aminooctylamino]-1,2,3,4-tetrahydroacridine | CHEMBL458487
TypeSmall organic molecule
Emp. Form.C23H34N4O3
Mol. Mass.414.5411
SMILES[O-][N+](=O)OCCNCCCCCCCCNc1c2CCCCc2nc2ccccc12