Reaction Details
Target72 kDa type IV collagenase
LigandBDBM50241252
Substrate/Competitorn/a
Meas. Tech.ChEMBL_561986 (CHEMBL1010049)
IC50 1.6±n/a nM
Citation Marques, SMNuti, ERossello, ASupuran, CTTuccinardi, TMartinelli, ASantos, MA Dual inhibitors of matrix metalloproteinases and carbonic anhydrases: iminodiacetyl-based hydroxamate-benzenesulfonamide conjugates. J Med Chem51:7968-79 (2008) 
 
72 kDa type IV collagenase
Name:72 kDa type IV collagenase
Type:Enzyme
Mol. Mass.:73870.36
Organism:Homo sapiens (Human)
Description: P08253
Residue:660
BDBM50241252
NameBDBM50241252
Synonyms:2-[hydroxycarbamoylmethyl-(4-phenoxy-benzenesulfonyl)-amino]-N-[2-(4-sulfamoyl-phenyl)-ethyl]-acetamide N-(4-Phenoxybenzenesulfonyl)-N-{[2-(4-sulfamoylphenyl)ethylcarbamoyl]methyl}aminoacetohydroxamic Acid
TypeSmall organic molecule
Emp. Form.C24H26N4O8S2
Mol. Mass.562.615
SMILESNS(=O)(=O)c1ccc(CCNC(=O)CN(CC(=O)NO)S(=O)(=O)c2ccc(Oc3ccccc3)cc2)cc1