Reaction Details
TargetMatrix metalloproteinase-16
LigandBDBM50246599
Substrate/Competitorn/a
Meas. Tech.ChEMBL_561991 (CHEMBL1010054)
IC50 0.310000±n/a nM
Citation Marques, SMNuti, ERossello, ASupuran, CTTuccinardi, TMartinelli, ASantos, MA Dual inhibitors of matrix metalloproteinases and carbonic anhydrases: iminodiacetyl-based hydroxamate-benzenesulfonamide conjugates. J Med Chem51:7968-79 (2008) 
 
Matrix metalloproteinase-16
Name:Matrix metalloproteinase-16
Type:PROTEIN
Mol. Mass.:69536.76
Organism:Homo sapiens (Human)
Description:ChEMBL_799129
Residue:607
BDBM50246599
NameBDBM50246599
Synonyms:CHEMBL471537 | N-(4-Phenoxybenzenesulfonyl)-N-{[2-(4-sulfamoylphenyl)ethylcarbamoyl]methyl}-D-valinehydroxamic Acid
TypeSmall organic molecule
Emp. Form.C27H32N4O8S2
Mol. Mass.604.695
SMILESCC(C)[C@@H](N(CC(=O)NCCc1ccc(cc1)S(N)(=O)=O)S(=O)(=O)c1ccc(Oc2ccccc2)cc1)C(=O)NO