Reaction Details
TargetDisintegrin and metalloproteinase domain-containing protein 17
LigandBDBM50246599
Substrate/Competitorn/a
Meas. Tech.ChEMBL_561992 (CHEMBL1010055)
IC50 55±n/a nM
Citation Marques, SMNuti, ERossello, ASupuran, CTTuccinardi, TMartinelli, ASantos, MA Dual inhibitors of matrix metalloproteinases and carbonic anhydrases: iminodiacetyl-based hydroxamate-benzenesulfonamide conjugates. J Med Chem51:7968-79 (2008) 
 
Disintegrin and metalloproteinase domain-containing protein 17
Name:Disintegrin and metalloproteinase domain-containing protein 17
Type:Enzyme
Mol. Mass.:93007.89
Organism:Homo sapiens (Human)
Description:
Residue:824
BDBM50246599
NameBDBM50246599
Synonyms:CHEMBL471537 | N-(4-Phenoxybenzenesulfonyl)-N-{[2-(4-sulfamoylphenyl)ethylcarbamoyl]methyl}-D-valinehydroxamic Acid
TypeSmall organic molecule
Emp. Form.C27H32N4O8S2
Mol. Mass.604.695
SMILESCC(C)[C@@H](N(CC(=O)NCCc1ccc(cc1)S(N)(=O)=O)S(=O)(=O)c1ccc(Oc2ccccc2)cc1)C(=O)NO