Reaction Details
TargetMatrix metalloproteinase-16
LigandBDBM50273426
Substrate/Competitorn/a
Meas. Tech.ChEMBL_561991 (CHEMBL1010054)
IC50 1.6±n/a nM
Citation Marques, SMNuti, ERossello, ASupuran, CTTuccinardi, TMartinelli, ASantos, MA Dual inhibitors of matrix metalloproteinases and carbonic anhydrases: iminodiacetyl-based hydroxamate-benzenesulfonamide conjugates. J Med Chem51:7968-79 (2008) 
 
Matrix metalloproteinase-16
Name:Matrix metalloproteinase-16
Type:PROTEIN
Mol. Mass.:69536.76
Organism:Homo sapiens (Human)
Description:ChEMBL_799129
Residue:607
BDBM50273426
NameBDBM50273426
Synonyms:CHEMBL515980 | N-(4-Phenoxybenzenesulfonyl)-N-hydroxycarbonylmethyl-D-valinehydroxamicAcid
TypeSmall organic molecule
Emp. Form.C19H22N2O7S
Mol. Mass.422.452
SMILESCC(C)[C@@H](N(CC(O)=O)S(=O)(=O)c1ccc(Oc2ccccc2)cc1)C(=O)NO