Reaction Details
TargetCarbonic anhydrase 1
LigandBDBM50241254
Substrate/Competitorn/a
Meas. Tech.ChEMBL_561993 (CHEMBL1010056)
Ki 2339±n/a nM
Citation Marques, SMNuti, ERossello, ASupuran, CTTuccinardi, TMartinelli, ASantos, MA Dual inhibitors of matrix metalloproteinases and carbonic anhydrases: iminodiacetyl-based hydroxamate-benzenesulfonamide conjugates. J Med Chem51:7968-79 (2008) 
 
Carbonic anhydrase 1
Name:Carbonic anhydrase 1
Type:Enzyme
Mol. Mass.:28873.37
Organism:Homo sapiens (Human)
Description:P00915
Residue:261
BDBM50241254
NameBDBM50241254
Synonyms:2-(benzyl-hydroxycarbamoylmethyl-amino)-N-[2-(4-sulfamoyl-phenyl)-ethyl]-acetamide N-Benzyl-N-{[2-(4-sulfamoylphenyl)ethylcarbamoyl]methyl}-aminoacetohydroxamic Acid
TypeSmall organic molecule
Emp. Form.C19H24N4O5S
Mol. Mass.420.483
SMILESNS(=O)(=O)c1ccc(CCNC(=O)CN(CC(=O)NO)Cc2ccccc2)cc1