Reaction Details
TargetAmine oxidase [flavin-containing] A
LigandBDBM50113840
Substrate/Competitorn/a
Meas. Tech.ChEMBL_561021 (CHEMBL1015261)
Ki 31000±n/a nM
Citation Milczek, EMBonivento, DBinda, CMattevi, AMcDonald, IAEdmondson, DE Structural and mechanistic studies of mofegiline inhibition of recombinant human monoamine oxidase B. J Med Chem51:8019-26 (2008) 
 
Amine oxidase [flavin-containing] A
Name:Amine oxidase [flavin-containing] A
Type:Protein
Mol. Mass.:59689.53
Organism:Homo sapiens (Human)
Description:P21397
Residue:527
BDBM50113840
NameBDBM50113840
Synonyms:4-Phenyl-butylamine CHEMBL79512
TypeSmall organic molecule
Emp. Form.C10H15N
Mol. Mass.149.2328
SMILESNCCCCc1ccccc1