Reaction Details
TargetNeuropeptide Y receptor type 1
LigandBDBM50246615
Substrate/Competitorn/a
Meas. Tech.ChEMBL_562263 (CHEMBL1011806)
Ki 27±n/a nM
Citation Keller, MPop, NHutzler, CBeck-Sickinger, AGBernhardt, GBuschauer, A Guanidine-acylguanidine bioisosteric approach in the design of radioligands: synthesis of a tritium-labeled N(G)-propionylargininamide ([3H]-UR-MK114) as a highly potent and selective neuropeptide Y Y1 receptor antagonist. J Med Chem51:8168-72 (2008) 
 
Neuropeptide Y receptor type 1
Name:Neuropeptide Y receptor type 1
Type:Enzyme Catalytic Domain
Mol. Mass.:44399.07
Organism:Homo sapiens (Human)
Description:NPY-Y1 NPY1R HUMAN::P25929
Residue:384
BDBM50246615
NameBDBM50246615
Synonyms:(R)-N-(4-hydroxybenzyl)-2-(2,2-diphenylacetamido)-5-(2-propylguanidino)pentanamide | CHEMBL515095
TypeSmall organic molecule
Emp. Form.C30H37N5O3
Mol. Mass.515.6465
SMILESCCCNC(N)=NCCC[C@@H](NC(=O)C(c1ccccc1)c1ccccc1)C(=O)NCc1ccc(O)cc1