Reaction Details
TargetMu-type opioid receptor
LigandBDBM50266025
Substrate/Competitorn/a
Meas. Tech.ChEMBL_540202 (CHEMBL1029831)
Ki 0.16±n/a nM
Citation Ballet, SFeytens, DWachter, RDVlaeminck, MDMarczak, EDSalvadori, SGraaf, CRognan, DNegri, LLattanzi, RLazarus, LHTourwé, DBalboni, G Conformationally constrained opioid ligands: the Dmt-Aba and Dmt-Aia versus Dmt-Tic scaffold. Bioorg Med Chem Lett19:433-7 (2008) 
 
Mu-type opioid receptor
Name:Mu-type opioid receptor
Type:G Protein-Coupled Receptor (GPCR)
Mol. Mass.:44503.11
Organism:Rattus norvegicus (rat)
Description:Competition binding assays were carried out using membrane preparations from transfected HN9.10 cells that constitutively expressed the mu opioid receptor.
Residue:398
BDBM50266025
NameBDBM50266025
Synonyms:(S)-2-((S)-2-amino-3-(4-hydroxy-2,6-dimethylphenyl)propanoyl)-N-(2-(benzylamino)-2-oxoethyl)-1,2,3,4-tetrahydroisoquinoline-3-carboxamide CHEMBL458631 H-Dmt-Tic-Gly-NH-CH2-Ph
TypeSmall organic molecule
Emp. Form.C30H34N4O4
Mol. Mass.514.6154
SMILESCc1cc(O)cc(C)c1C[C@H](N)C(=O)N1Cc2ccccc2C[C@H]1C(=O)NCC(=O)NCc1ccccc1