Reaction Details
TargetCannabinoid receptor 1
LigandBDBM50254044
Substrate/Competitorn/a
Meas. Tech.ChEMBL_560058 (CHEMBL1022445)
EC50>2000±n/a nM
Citation Marx, IEDiMauro, EFCheng, AEmkey, RHitchcock, SAHuang, LHuang, MYHuman, JLee, JHLi, XMartin, MWWhite, RDFremeau, RTPatel, VF Discovery of alpha-amidosulfones as potent and selective agonists of CB2: synthesis, SAR, and pharmacokinetic properties. Bioorg Med Chem Lett19:31-5 (2008) 
 
Cannabinoid receptor 1
Name:Cannabinoid receptor 1
Type:G Protein-Coupled Receptor (GPCR)
Mol. Mass.:52868.96
Organism:Homo sapiens (Human)
Description:P21554
Residue:472
BDBM50254044
NameBDBM50254044
Synonyms:CHEMBL540704 | N-(9-ethyl-9H-carbazol-3-yl)-3-(3-(2-fluorophenyl)-1,2,4-oxadiazol-5-yl)propanamide
TypeSmall organic molecule
Emp. Form.C25H21FN4O2
Mol. Mass.428.4582
SMILESCCn1c2ccccc2c2cc(NC(=O)CCc3nc(no3)-c3ccccc3F)ccc12