Reaction Details
TargetCannabinoid receptor 2
LigandBDBM50254066
Substrate/Competitorn/a
Meas. Tech.ChEMBL_560056 (CHEMBL1022443)
EC50 4±n/a nM
Citation Marx, IEDiMauro, EFCheng, AEmkey, RHitchcock, SAHuang, LHuang, MYHuman, JLee, JHLi, XMartin, MWWhite, RDFremeau, RTPatel, VF Discovery of alpha-amidosulfones as potent and selective agonists of CB2: synthesis, SAR, and pharmacokinetic properties. Bioorg Med Chem Lett19:31-5 (2008) 
 
Cannabinoid receptor 2
Name:Cannabinoid receptor 2
Type:G Protein-Coupled Receptor (GPCR)
Mol. Mass.:39690.94
Organism:Homo sapiens (Human)
Description:P34972
Residue:360
BDBM50254066
NameBDBM50254066
Synonyms:1-(phenylsulfonyl)-N-(quinolin-3-yl)cyclopropanecarboxamide | CHEMBL467010
TypeSmall organic molecule
Emp. Form.C19H16N2O3S
Mol. Mass.352.407
SMILESO=C(Nc1cnc2ccccc2c1)C1(CC1)S(=O)(=O)c1ccccc1