Reaction Details
TargetCannabinoid receptor 2
LigandBDBM50254162
Substrate/Competitorn/a
Meas. Tech.ChEMBL_560036 (CHEMBL1021556)
EC50 216±n/a nM
Citation Marx, IEDiMauro, EFCheng, AEmkey, RHitchcock, SAHuang, LHuang, MYHuman, JLee, JHLi, XMartin, MWWhite, RDFremeau, RTPatel, VF Discovery of alpha-amidosulfones as potent and selective agonists of CB2: synthesis, SAR, and pharmacokinetic properties. Bioorg Med Chem Lett19:31-5 (2008) 
 
Cannabinoid receptor 2
Name:Cannabinoid receptor 2
Type:G Protein-Coupled Receptor (GPCR)
Mol. Mass.:39690.94
Organism:Homo sapiens (Human)
Description:P34972
Residue:360
BDBM50254162
NameBDBM50254162
Synonyms:2-(4-chlorophenylsulfonyl)-2-methyl-N-(5-(3-methyl-tetrahydrofuran-3-yl)-1,3,4-thiadiazol-2-yl)propanamide | CHEMBL452209
TypeSmall organic molecule
Emp. Form.C17H20ClN3O4S2
Mol. Mass.429.941
SMILESCC(C)(C(=O)Nc1nnc(s1)C1(C)CCOC1)S(=O)(=O)c1ccc(Cl)cc1