Reaction Details
TargetCannabinoid receptor 2
LigandBDBM50254145
Substrate/Competitorn/a
Meas. Tech.ChEMBL_560036 (CHEMBL1021556)
EC50 3860±n/a nM
Citation Marx, IEDiMauro, EFCheng, AEmkey, RHitchcock, SAHuang, LHuang, MYHuman, JLee, JHLi, XMartin, MWWhite, RDFremeau, RTPatel, VF Discovery of alpha-amidosulfones as potent and selective agonists of CB2: synthesis, SAR, and pharmacokinetic properties. Bioorg Med Chem Lett19:31-5 (2008) 
 
Cannabinoid receptor 2
Name:Cannabinoid receptor 2
Type:G Protein-Coupled Receptor (GPCR)
Mol. Mass.:39690.94
Organism:Homo sapiens (Human)
Description:P34972
Residue:360
BDBM50254145
NameBDBM50254145
Synonyms:2-(4-chlorophenylsulfonyl)-2-methyl-N-(5-methylisoxazol-3-yl)propanamide | CHEMBL466822
TypeSmall organic molecule
Emp. Form.C14H15ClN2O4S
Mol. Mass.342.798
SMILESCc1cc(NC(=O)C(C)(C)S(=O)(=O)c2ccc(Cl)cc2)no1