Reaction Details
TargetCannabinoid receptor 2
LigandBDBM50254125
Substrate/Competitorn/a
Meas. Tech.ChEMBL_560036 (CHEMBL1021556)
EC50 86±n/a nM
Citation Marx, IEDiMauro, EFCheng, AEmkey, RHitchcock, SAHuang, LHuang, MYHuman, JLee, JHLi, XMartin, MWWhite, RDFremeau, RTPatel, VF Discovery of alpha-amidosulfones as potent and selective agonists of CB2: synthesis, SAR, and pharmacokinetic properties. Bioorg Med Chem Lett19:31-5 (2008) 
 
Cannabinoid receptor 2
Name:Cannabinoid receptor 2
Type:G Protein-Coupled Receptor (GPCR)
Mol. Mass.:39690.94
Organism:Homo sapiens (Human)
Description:P34972
Residue:360
BDBM50254125
NameBDBM50254125
Synonyms:CHEMBL506707 | N-(3-bromo-4-chlorophenyl)-2-(4-chlorophenylsulfonyl)-2-methylpropanamide
TypeSmall organic molecule
Emp. Form.C16H14BrCl2NO3S
Mol. Mass.451.162
SMILESCC(C)(C(=O)Nc1ccc(Cl)c(Br)c1)S(=O)(=O)c1ccc(Cl)cc1