Reaction Details
TargetCannabinoid receptor 2
LigandBDBM50254100
Substrate/Competitorn/a
Meas. Tech.ChEMBL_560040 (CHEMBL1021560)
EC50 33±n/a nM
Citation Marx, IEDiMauro, EFCheng, AEmkey, RHitchcock, SAHuang, LHuang, MYHuman, JLee, JHLi, XMartin, MWWhite, RDFremeau, RTPatel, VF Discovery of alpha-amidosulfones as potent and selective agonists of CB2: synthesis, SAR, and pharmacokinetic properties. Bioorg Med Chem Lett19:31-5 (2008) 
 
Cannabinoid receptor 2
Name:Cannabinoid receptor 2
Type:G Protein-Coupled Receptor (GPCR)
Mol. Mass.:39690.94
Organism:Homo sapiens (Human)
Description:P34972
Residue:360
BDBM50254100
NameBDBM50254100
Synonyms:2-(4-fluorophenylsulfonyl)-2-methyl-N-(quinolin-3-yl)propanamide | CHEMBL467640
TypeSmall organic molecule
Emp. Form.C19H17FN2O3S
Mol. Mass.372.413
SMILESCC(C)(C(=O)Nc1cnc2ccccc2c1)S(=O)(=O)c1ccc(F)cc1