Reaction Details
TargetCannabinoid receptor 1
LigandBDBM50254067
Substrate/Competitorn/a
Meas. Tech.ChEMBL_560042 (CHEMBL1022429)
EC50 82±n/a nM
Citation Marx, IEDiMauro, EFCheng, AEmkey, RHitchcock, SAHuang, LHuang, MYHuman, JLee, JHLi, XMartin, MWWhite, RDFremeau, RTPatel, VF Discovery of alpha-amidosulfones as potent and selective agonists of CB2: synthesis, SAR, and pharmacokinetic properties. Bioorg Med Chem Lett19:31-5 (2008) 
 
Cannabinoid receptor 1
Name:Cannabinoid receptor 1
Type:G Protein-Coupled Receptor (GPCR)
Mol. Mass.:52868.96
Organism:Homo sapiens (Human)
Description:P21554
Residue:472
BDBM50254067
NameBDBM50254067
Synonyms:2-methyl-N-(quinolin-3-yl)-2-(4-(trifluoromethyl)phenylsulfonyl)propanamide | CHEMBL512591
TypeSmall organic molecule
Emp. Form.C20H17F3N2O3S
Mol. Mass.422.421
SMILESCC(C)(C(=O)Nc1cnc2ccccc2c1)S(=O)(=O)c1ccc(cc1)C(F)(F)F