Reaction Details
TargetCannabinoid receptor 1
LigandBDBM50254161
Substrate/Competitorn/a
Meas. Tech.ChEMBL_560038 (CHEMBL1021558)
EC50 1920±n/a nM
Citation Marx, IEDiMauro, EFCheng, AEmkey, RHitchcock, SAHuang, LHuang, MYHuman, JLee, JHLi, XMartin, MWWhite, RDFremeau, RTPatel, VF Discovery of alpha-amidosulfones as potent and selective agonists of CB2: synthesis, SAR, and pharmacokinetic properties. Bioorg Med Chem Lett19:31-5 (2008) 
 
Cannabinoid receptor 1
Name:Cannabinoid receptor 1
Type:G Protein-Coupled Receptor (GPCR)
Mol. Mass.:52868.96
Organism:Homo sapiens (Human)
Description:P21554
Residue:472
BDBM50254161
NameBDBM50254161
Synonyms:CHEMBL461011 | N-(5-tert-butylisoxazol-3-yl)-2-(4-chlorophenylsulfonyl)-2-methylpropanamide
TypeSmall organic molecule
Emp. Form.C17H21ClN2O4S
Mol. Mass.384.878
SMILESCC(C)(C)c1cc(NC(=O)C(C)(C)S(=O)(=O)c2ccc(Cl)cc2)no1