Reaction Details
TargetCannabinoid receptor 1
LigandBDBM50254146
Substrate/Competitorn/a
Meas. Tech.ChEMBL_560038 (CHEMBL1021558)
EC50>10000±n/a nM
Citation Marx, IEDiMauro, EFCheng, AEmkey, RHitchcock, SAHuang, LHuang, MYHuman, JLee, JHLi, XMartin, MWWhite, RDFremeau, RTPatel, VF Discovery of alpha-amidosulfones as potent and selective agonists of CB2: synthesis, SAR, and pharmacokinetic properties. Bioorg Med Chem Lett19:31-5 (2008) 
 
Cannabinoid receptor 1
Name:Cannabinoid receptor 1
Type:G Protein-Coupled Receptor (GPCR)
Mol. Mass.:52868.96
Organism:Homo sapiens (Human)
Description:P21554
Residue:472
BDBM50254146
NameBDBM50254146
Synonyms:2-(4-chlorophenylsulfonyl)-2-methyl-N-(5-methylthiazol-2-yl)propanamide | CHEMBL466823
TypeSmall organic molecule
Emp. Form.C14H15ClN2O3S2
Mol. Mass.358.864
SMILESCc1cnc(NC(=O)C(C)(C)S(=O)(=O)c2ccc(Cl)cc2)s1