Reaction Details
TargetCannabinoid receptor 1
LigandBDBM50254144
Substrate/Competitorn/a
Meas. Tech.ChEMBL_560038 (CHEMBL1021558)
EC50 322±n/a nM
Citation Marx, IEDiMauro, EFCheng, AEmkey, RHitchcock, SAHuang, LHuang, MYHuman, JLee, JHLi, XMartin, MWWhite, RDFremeau, RTPatel, VF Discovery of alpha-amidosulfones as potent and selective agonists of CB2: synthesis, SAR, and pharmacokinetic properties. Bioorg Med Chem Lett19:31-5 (2008) 
 
Cannabinoid receptor 1
Name:Cannabinoid receptor 1
Type:G Protein-Coupled Receptor (GPCR)
Mol. Mass.:52868.96
Organism:Homo sapiens (Human)
Description:P21554
Residue:472
BDBM50254144
NameBDBM50254144
Synonyms:2-(4-chlorophenylsulfonyl)-2-methyl-N-(5-(5-methylthiophen-2-yl)pyridin-3-yl)propanamide | CHEMBL466821
TypeSmall organic molecule
Emp. Form.C20H19ClN2O3S2
Mol. Mass.434.959
SMILESCc1ccc(s1)-c1cncc(NC(=O)C(C)(C)S(=O)(=O)c2ccc(Cl)cc2)c1