Reaction Details
TargetCannabinoid receptor 1
LigandBDBM50254127
Substrate/Competitorn/a
Meas. Tech.ChEMBL_560038 (CHEMBL1021558)
EC50>10000±n/a nM
Citation Marx, IEDiMauro, EFCheng, AEmkey, RHitchcock, SAHuang, LHuang, MYHuman, JLee, JHLi, XMartin, MWWhite, RDFremeau, RTPatel, VF Discovery of alpha-amidosulfones as potent and selective agonists of CB2: synthesis, SAR, and pharmacokinetic properties. Bioorg Med Chem Lett19:31-5 (2008) 
 
Cannabinoid receptor 1
Name:Cannabinoid receptor 1
Type:G Protein-Coupled Receptor (GPCR)
Mol. Mass.:52868.96
Organism:Homo sapiens (Human)
Description:P21554
Residue:472
BDBM50254127
NameBDBM50254127
Synonyms:CHEMBL449341 | N-(4-chloro-2-cyanophenyl)-2-(4-chlorophenylsulfonyl)-2-methylpropanamide
TypeSmall organic molecule
Emp. Form.C17H14Cl2N2O3S
Mol. Mass.397.276
SMILESCC(C)(C(=O)Nc1ccc(Cl)cc1C#N)S(=O)(=O)c1ccc(Cl)cc1