Reaction Details
TargetD(3) dopamine receptor
LigandBDBM50265390
Substrate/Competitorn/a
Meas. Tech.ChEMBL_558362 (CHEMBL954164)
Ki 8.2±n/a nM
Citation Butini, SGemma, SCampiani, GFranceschini, STrotta, FBorriello, MCeres, NRos, SCoccone, SSBernetti, MDe Angelis, MBrindisi, MNacci, VFiorini, INovellino, ECagnotto, AMennini, TSandager-Nielsen, KAndreasen, JTScheel-Kruger, JMikkelsen, JDFattorusso, C Discovery of a new class of potential multifunctional atypical antipsychotic agents targeting dopamine D3 and serotonin 5-HT1A and 5-HT2A receptors: design, synthesis, and effects on behavior. J Med Chem52:151-69 (2009) 
 
D(3) dopamine receptor
Name:D(3) dopamine receptor
Type:n/a
Mol. Mass.:44243.43
Organism:Homo sapiens (Human)
Description:n/a
Residue:400
BDBM50265390
NameBDBM50265390
Synonyms:7-[4-[4-(2,3-Dichlorophenyl)piperazin-1-yl]butyloxy]quinoline | CHEMBL497988
TypeSmall organic molecule
Emp. Form.C23H25Cl2N3O
Mol. Mass.430.37
SMILESClc1cccc(N2CCN(CCCCOc3ccc4cccnc4c3)CC2)c1Cl