Reaction Details
TargetD(3) dopamine receptor
LigandBDBM50265375
Substrate/Competitorn/a
Meas. Tech.ChEMBL_558362 (CHEMBL954164)
Ki 0.105±n/a nM
Citation Butini, SGemma, SCampiani, GFranceschini, STrotta, FBorriello, MCeres, NRos, SCoccone, SSBernetti, MDe Angelis, MBrindisi, MNacci, VFiorini, INovellino, ECagnotto, AMennini, TSandager-Nielsen, KAndreasen, JTScheel-Kruger, JMikkelsen, JDFattorusso, C Discovery of a new class of potential multifunctional atypical antipsychotic agents targeting dopamine D3 and serotonin 5-HT1A and 5-HT2A receptors: design, synthesis, and effects on behavior. J Med Chem52:151-69 (2009) 
 
D(3) dopamine receptor
Name:D(3) dopamine receptor
Type:n/a
Mol. Mass.:44243.43
Organism:Homo sapiens (Human)
Description:n/a
Residue:400
BDBM50265375
NameBDBM50265375
Synonyms:CHEMBL496531 | N-[4-[4-(2,3-Dichlorophenyl)piperazin-1-yl]butyl]3,4-dihydropyrazino[1,2-a]indol-1(2H)-one
TypeSmall organic molecule
Emp. Form.C25H28Cl2N4O
Mol. Mass.471.422
SMILESClc1cccc(N2CCN(CCCCN3CCn4c(cc5ccccc45)C3=O)CC2)c1Cl