Reaction Details
TargetD(3) dopamine receptor
LigandBDBM50265373
Substrate/Competitorn/a
Meas. Tech.ChEMBL_558362 (CHEMBL954164)
Ki 3.7±n/a nM
Citation Butini, SGemma, SCampiani, GFranceschini, STrotta, FBorriello, MCeres, NRos, SCoccone, SSBernetti, MDe Angelis, MBrindisi, MNacci, VFiorini, INovellino, ECagnotto, AMennini, TSandager-Nielsen, KAndreasen, JTScheel-Kruger, JMikkelsen, JDFattorusso, C Discovery of a new class of potential multifunctional atypical antipsychotic agents targeting dopamine D3 and serotonin 5-HT1A and 5-HT2A receptors: design, synthesis, and effects on behavior. J Med Chem52:151-69 (2009) 
 
D(3) dopamine receptor
Name:D(3) dopamine receptor
Type:n/a
Mol. Mass.:44243.43
Organism:Homo sapiens (Human)
Description:n/a
Residue:400
BDBM50265373
NameBDBM50265373
Synonyms:CHEMBL497573 | N-[4-[4-(3-Cyanophenyl)piperazin-1-yl]butyl]3,4-dihydropyrazino[1,2-a]indol-1(2H)-one
TypeSmall organic molecule
Emp. Form.C26H29N5O
Mol. Mass.427.5414
SMILESO=C1N(CCCCN2CCN(CC2)c2cccc(c2)C#N)CCn2c1cc1ccccc21